From AAA, 2 Months ago, written in Plain Text.
Embed
  1. Running unit tests...
  2. PHPUnit 5.7.27 by Sebastian Bergmann and contributors.
  3.  
  4. ..[36;1mS[0m[36;1mS[0m[36;1mS[0m[36;1mS[0m[36;1mS[0m[36;1mS[0m[36;1mS[0m[36;1mS[0m[36;1mS[0m[36;1mS[0m[36;1mS[0m[36;1mS[0m[36;1mS[0m........[36;1mS[0m.........[36;1mS[0m....[36;1mS[0m[36;1mS[0m[36;1mS[0m[36;1mS[0m[36;1mS[0m[36;1mS[0m[36;1mS[0m[36;1mS[0m...............   61 / 1091 (  5%)
  5. ..............[31;1mE[0m[31;1mE[0m[31;1mE[0m............................................  122 / 1091 ( 11%)
  6. ...................................................[31;1mE[0m.........  183 / 1091 ( 16%)
  7. ......[31;1mE[0m....[31;1mE[0m...[31;1mE[0m...[31;1mE[0m[31;1mE[0m.[31;1mE[0m..........[31;1mE[0m.[31;1mE[0m.[31;1mE[0m............[31;1mE[0m.......[31;1mE[0m..  244 / 1091 ( 22%)
  8. .......................[31;1mE[0m......[31;1mE[0m...............[31;1mE[0m.........[31;1mE[0m....  305 / 1091 ( 27%)
  9. ........[31;1mE[0m....[31;1mE[0m.[31;1mE[0m........[31;1mE[0m.........[31;1mE[0m.............[31;1mE[0m...........[31;1mE[0m  366 / 1091 ( 33%)
  10. .[31;1mE[0m...........[31;1mE[0m..[31;1mE[0m.[31;1mE[0m...[31;1mE[0m......[31;1mE[0m..[31;1mE[0m[31;1mE[0m.....[31;1mE[0m........[31;1mE[0m..[31;1mE[0m.........  427 / 1091 ( 39%)
  11. ...[31;1mE[0m.................[31;1mE[0m....[31;1mE[0m............[31;1mE[0m......[31;1mE[0m[31;1mE[0m.............  488 / 1091 ( 44%)
  12. ......[31;1mE[0m.........[41;37mF[0m[36;1mS[0m[36;1mS[0m[36;1mS[0m[36;1mS[0m[36;1mS[0m[36;1mS[0m[36;1mS[0m[36;1mS[0m[36;1mS[0m[36;1mS[0m[36;1mS[0m[36;1mS[0m[36;1mS[0m[36;1mS[0m[36;1mS[0m[36;1mS[0m[36;1mS[0m[36;1mS[0m[36;1mS[0m[36;1mS[0m[36;1mS[0m[36;1mS[0m[36;1mS[0m[36;1mS[0m[36;1mS[0m[36;1mS[0m[36;1mS[0m[36;1mS[0m[36;1mS[0m[36;1mS[0m[36;1mS[0m[36;1mS[0m[36;1mS[0m[36;1mS[0m[36;1mS[0m[36;1mS[0m[36;1mS[0m[36;1mS[0m[36;1mS[0m[36;1mS[0m[36;1mS[0m[36;1mS[0m[36;1mS[0m[36;1mS[0m  549 / 1091 ( 50%)
  13. [36;1mS[0m[36;1mS[0m[36;1mS[0m[36;1mS[0m[36;1mS[0m[36;1mS[0m[36;1mS[0m[36;1mS[0m[36;1mS[0m[36;1mS[0m[36;1mS[0m[36;1mS[0m[36;1mS[0m[36;1mS[0m[36;1mS[0m[36;1mS[0m[36;1mS[0m[36;1mS[0m[36;1mS[0m[36;1mS[0m[36;1mS[0m[36;1mS[0m[36;1mS[0m[36;1mS[0m[36;1mS[0m[36;1mS[0m[36;1mS[0m[36;1mS[0m[36;1mS[0m[36;1mS[0m[36;1mS[0m[36;1mS[0m[36;1mS[0m[36;1mS[0m[36;1mS[0m[36;1mS[0m[36;1mS[0m[36;1mS[0m[36;1mS[0m[36;1mS[0m[36;1mS[0m[36;1mS[0m[36;1mS[0m[36;1mS[0m[36;1mS[0m[36;1mS[0m[36;1mS[0m[36;1mS[0m[36;1mS[0m[36;1mS[0m[36;1mS[0m[36;1mS[0m[36;1mS[0m[36;1mS[0m[36;1mS[0m[36;1mS[0m[36;1mS[0m[36;1mS[0m[36;1mS[0m[36;1mS[0m[36;1mS[0m  610 / 1091 ( 55%)
  14. [36;1mS[0m[36;1mS[0m[36;1mS[0m[36;1mS[0m[36;1mS[0m[36;1mS[0m[36;1mS[0m[36;1mS[0m[36;1mS[0m[36;1mS[0m[36;1mS[0m[36;1mS[0m[36;1mS[0m[36;1mS[0m[36;1mS[0m[36;1mS[0m[36;1mS[0m[36;1mS[0m[36;1mS[0m[36;1mS[0m[36;1mS[0m[36;1mS[0m[36;1mS[0m[36;1mS[0m[36;1mS[0m[36;1mS[0m[36;1mS[0m[36;1mS[0m[36;1mS[0m[36;1mS[0m[36;1mS[0m[36;1mS[0m[36;1mS[0m[36;1mS[0m[36;1mS[0m[36;1mS[0m[36;1mS[0m[36;1mS[0m[36;1mS[0m[36;1mS[0m[36;1mS[0m[36;1mS[0m[36;1mS[0m[36;1mS[0m[36;1mS[0m[36;1mS[0m[36;1mS[0m[36;1mS[0m[36;1mS[0m[36;1mS[0m[36;1mS[0m[36;1mS[0m[36;1mS[0m[36;1mS[0m[36;1mS[0m[36;1mS[0m[36;1mS[0m[36;1mS[0m[36;1mS[0m[36;1mS[0m[36;1mS[0m  671 / 1091 ( 61%)
  15. [36;1mS[0m[36;1mS[0m[36;1mS[0m[36;1mS[0m[36;1mS[0m[36;1mS[0m[36;1mS[0m[36;1mS[0m[36;1mS[0m[36;1mS[0m[36;1mS[0m[36;1mS[0m[36;1mS[0m[36;1mS[0m[36;1mS[0m[36;1mS[0m[36;1mS[0m[36;1mS[0m[36;1mS[0m[36;1mS[0m[36;1mS[0m[36;1mS[0m[36;1mS[0m[36;1mS[0m[36;1mS[0m[36;1mS[0m[36;1mS[0m[36;1mS[0m[36;1mS[0m[36;1mS[0m[36;1mS[0m[36;1mS[0m[36;1mS[0m[36;1mS[0m[36;1mS[0m[36;1mS[0m[36;1mS[0m[36;1mS[0m[36;1mS[0m[36;1mS[0m[36;1mS[0m[36;1mS[0m[36;1mS[0m[36;1mS[0m[36;1mS[0m[36;1mS[0m[36;1mS[0m[36;1mS[0m[36;1mS[0m[36;1mS[0m[36;1mS[0m[36;1mS[0m[36;1mS[0m[36;1mS[0m[36;1mS[0m[36;1mS[0m[36;1mS[0m[36;1mS[0m[36;1mS[0m[36;1mS[0m[36;1mS[0m  732 / 1091 ( 67%)
  16. [36;1mS[0m[36;1mS[0m[36;1mS[0m[36;1mS[0m[36;1mS[0m[36;1mS[0m[36;1mS[0m[36;1mS[0m[36;1mS[0m[36;1mS[0m[36;1mS[0m[36;1mS[0m[36;1mS[0m[36;1mS[0m[36;1mS[0m[36;1mS[0m[36;1mS[0m[36;1mS[0m[36;1mS[0m[36;1mS[0m[36;1mS[0m[36;1mS[0m[36;1mS[0m[36;1mS[0m[36;1mS[0m[36;1mS[0m[36;1mS[0m[36;1mS[0m[36;1mS[0m[36;1mS[0m[36;1mS[0m[36;1mS[0m[36;1mS[0m[36;1mS[0m[36;1mS[0m[36;1mS[0m[36;1mS[0m[36;1mS[0m[36;1mS[0m[36;1mS[0m[36;1mS[0m[36;1mS[0m[36;1mS[0m[36;1mS[0m[36;1mS[0m[36;1mS[0m[36;1mS[0m[36;1mS[0m[36;1mS[0m[36;1mS[0m[36;1mS[0m[36;1mS[0m[36;1mS[0m[36;1mS[0m[36;1mS[0m[36;1mS[0m[36;1mS[0m[36;1mS[0m[36;1mS[0m[36;1mS[0m[36;1mS[0m  793 / 1091 ( 72%)
  17. [36;1mS[0m[36;1mS[0m[36;1mS[0m[36;1mS[0m[36;1mS[0m[36;1mS[0m[36;1mS[0m[36;1mS[0m[36;1mS[0m[36;1mS[0m[36;1mS[0m[36;1mS[0m[36;1mS[0m[36;1mS[0m[36;1mS[0m[36;1mS[0m[36;1mS[0m[36;1mS[0m[36;1mS[0m[36;1mS[0m[36;1mS[0m[36;1mS[0m[36;1mS[0m[36;1mS[0m[36;1mS[0m[36;1mS[0m[36;1mS[0m[36;1mS[0m[36;1mS[0m[36;1mS[0m[36;1mS[0m[36;1mS[0m[36;1mS[0m[36;1mS[0m[36;1mS[0m[36;1mS[0m[36;1mS[0m[36;1mS[0m[36;1mS[0m[36;1mS[0m[36;1mS[0m[36;1mS[0m[36;1mS[0m[36;1mS[0m[36;1mS[0m[36;1mS[0m[36;1mS[0m[36;1mS[0m[36;1mS[0m[36;1mS[0m[36;1mS[0m[36;1mS[0m[36;1mS[0m[36;1mS[0m[36;1mS[0m[36;1mS[0m[36;1mS[0m[36;1mS[0m[36;1mS[0m[36;1mS[0m[36;1mS[0m  854 / 1091 ( 78%)
  18. [36;1mS[0m[36;1mS[0m[36;1mS[0m[36;1mS[0m[36;1mS[0m[36;1mS[0m[36;1mS[0m[36;1mS[0m[36;1mS[0m[36;1mS[0m[36;1mS[0m[36;1mS[0m[36;1mS[0m[36;1mS[0m[36;1mS[0m[36;1mS[0m[36;1mS[0m[36;1mS[0m[36;1mS[0m[36;1mS[0m[36;1mS[0m[36;1mS[0m[36;1mS[0m[36;1mS[0m[36;1mS[0m[36;1mS[0m[36;1mS[0m[36;1mS[0m[36;1mS[0m[36;1mS[0m[36;1mS[0m[36;1mS[0m[36;1mS[0m[36;1mS[0m[36;1mS[0m[36;1mS[0m[36;1mS[0m[36;1mS[0m[36;1mS[0m[36;1mS[0m[36;1mS[0m[36;1mS[0m[36;1mS[0m[36;1mS[0m[36;1mS[0m[36;1mS[0m[36;1mS[0m[36;1mS[0m[36;1mS[0m[36;1mS[0m[36;1mS[0m[36;1mS[0m[36;1mS[0m[36;1mS[0m[36;1mS[0m[36;1mS[0m[36;1mS[0m[36;1mS[0m[36;1mS[0m[36;1mS[0m[36;1mS[0m  915 / 1091 ( 83%)
  19. [36;1mS[0m[36;1mS[0m[36;1mS[0m[36;1mS[0m[36;1mS[0m[36;1mS[0m[36;1mS[0m[36;1mS[0m[36;1mS[0m[36;1mS[0m[36;1mS[0m[36;1mS[0m[36;1mS[0m[36;1mS[0m[36;1mS[0m[36;1mS[0m[36;1mS[0m[36;1mS[0m[36;1mS[0m[36;1mS[0m[36;1mS[0m[36;1mS[0m[36;1mS[0m[36;1mS[0m[36;1mS[0m[36;1mS[0m[36;1mS[0m[36;1mS[0m[36;1mS[0m[36;1mS[0m[36;1mS[0m[36;1mS[0m[36;1mS[0m[36;1mS[0m[36;1mS[0m[36;1mS[0m[36;1mS[0m[36;1mS[0m[36;1mS[0m[36;1mS[0m[36;1mS[0m[36;1mS[0m[36;1mS[0m[36;1mS[0m[36;1mS[0m[36;1mS[0m[36;1mS[0m[36;1mS[0m[36;1mS[0m[36;1mS[0m[36;1mS[0m[36;1mS[0m[36;1mS[0m[36;1mS[0m[36;1mS[0m[36;1mS[0m[36;1mS[0m[36;1mS[0m[36;1mS[0m[36;1mS[0m[36;1mS[0m  976 / 1091 ( 89%)
  20. [36;1mS[0m[36;1mS[0m[36;1mS[0m[36;1mS[0m[36;1mS[0m[36;1mS[0m[36;1mS[0m[36;1mS[0m[36;1mS[0m[36;1mS[0m[36;1mS[0m[36;1mS[0m[36;1mS[0m[36;1mS[0m[36;1mS[0m[36;1mS[0m[36;1mS[0m[36;1mS[0m[36;1mS[0m[36;1mS[0m[36;1mS[0m[36;1mS[0m[36;1mS[0m[36;1mS[0m[36;1mS[0m[36;1mS[0m[36;1mS[0m[36;1mS[0m[36;1mS[0m[36;1mS[0m[36;1mS[0m[36;1mS[0m[36;1mS[0m[36;1mS[0m[36;1mS[0m[36;1mS[0m[36;1mS[0m[36;1mS[0m[36;1mS[0m[36;1mS[0m[36;1mS[0m[36;1mS[0m[36;1mS[0m[36;1mS[0m[36;1mS[0m[36;1mS[0m[36;1mS[0m[36;1mS[0m[36;1mS[0m[36;1mS[0m[36;1mS[0m[36;1mS[0m[36;1mS[0m[36;1mS[0m[36;1mS[0m[36;1mS[0m[36;1mS[0m[36;1mS[0m[36;1mS[0m[36;1mS[0m[36;1mS[0m 1037 / 1091 ( 95%)
  21. ................................[31;1mE[0m[31;1mE[0m[31;1mE[0m[31;1mE[0m[31;1mE[0m[31;1mE[0m[31;1mE[0m....[31;1mE[0m[31;1mE[0m[31;1mE[0m[31;1mE[0m[31;1mE[0m[31;1mE[0m[31;1mE[0m[31;1mE[0m...        1091 / 1091 (100%)
  22.  
  23. Time: 16.55 seconds, Memory: 50.00MB
  24.  
  25. There were 59 errors:
  26.  
  27. 1) LibreNMS\Tests\OSDiscoveryTest::testOS with data set "airos-af-ltu" ('airos-af-ltu')
  28. Exception: Could not translate oid: SFA-INFO::systemName.0
  29. Tried: snmptranslate -IR -On SFA-INFO::systemName.0 -M /usr/local/www/librenms/mibs
  30.  
  31. /usr/local/www/librenms/tests/mocks/mock.snmp.inc.php:150
  32. /usr/local/www/librenms/tests/mocks/mock.snmp.inc.php:211
  33. /usr/local/www/librenms/includes/functions.php:254
  34. /usr/local/www/librenms/includes/functions.php:180
  35. /usr/local/www/librenms/tests/OSDiscoveryTest.php:108
  36. /usr/local/www/librenms/tests/OSDiscoveryTest.php:76
  37.  
  38. 2) LibreNMS\Tests\OSDiscoveryTest::testOS with data set "airos-af" ('airos-af')
  39. Exception: Could not translate oid: systemStatus.0
  40. Tried: snmptranslate -IR -On systemStatus.0 -M /usr/local/www/librenms/mibs:/usr/local/www/librenms/mibs/synology -m SYNOLOGY-SYSTEM-MIB
  41.  
  42. /usr/local/www/librenms/tests/mocks/mock.snmp.inc.php:150
  43. /usr/local/www/librenms/tests/mocks/mock.snmp.inc.php:211
  44. /usr/local/www/librenms/includes/functions.php:254
  45. /usr/local/www/librenms/includes/functions.php:180
  46. /usr/local/www/librenms/tests/OSDiscoveryTest.php:108
  47. /usr/local/www/librenms/tests/OSDiscoveryTest.php:76
  48.  
  49. 3) LibreNMS\Tests\OSDiscoveryTest::testOS with data set "airos" ('airos')
  50. Exception: Could not translate oid: systemStatus.0
  51. Tried: snmptranslate -IR -On systemStatus.0 -M /usr/local/www/librenms/mibs:/usr/local/www/librenms/mibs/synology -m SYNOLOGY-SYSTEM-MIB
  52.  
  53. /usr/local/www/librenms/tests/mocks/mock.snmp.inc.php:150
  54. /usr/local/www/librenms/tests/mocks/mock.snmp.inc.php:211
  55. /usr/local/www/librenms/includes/functions.php:254
  56. /usr/local/www/librenms/includes/functions.php:180
  57. /usr/local/www/librenms/tests/OSDiscoveryTest.php:108
  58. /usr/local/www/librenms/tests/OSDiscoveryTest.php:76
  59.  
  60. 4) LibreNMS\Tests\OSDiscoveryTest::testOS with data set "ddnos" ('ddnos')
  61. Exception: Could not translate oid: SFA-INFO::systemName.0
  62. Tried: snmptranslate -IR -On SFA-INFO::systemName.0 -M /usr/local/www/librenms/mibs
  63.  
  64. /usr/local/www/librenms/tests/mocks/mock.snmp.inc.php:150
  65. /usr/local/www/librenms/tests/mocks/mock.snmp.inc.php:211
  66. /usr/local/www/librenms/includes/functions.php:254
  67. /usr/local/www/librenms/includes/functions.php:180
  68. /usr/local/www/librenms/tests/OSDiscoveryTest.php:108
  69. /usr/local/www/librenms/tests/OSDiscoveryTest.php:76
  70.  
  71. 5) LibreNMS\Tests\OSDiscoveryTest::testOS with data set "dsm" ('dsm')
  72. Exception: Could not translate oid: SFA-INFO::systemName.0
  73. Tried: snmptranslate -IR -On SFA-INFO::systemName.0 -M /usr/local/www/librenms/mibs
  74.  
  75. /usr/local/www/librenms/tests/mocks/mock.snmp.inc.php:150
  76. /usr/local/www/librenms/tests/mocks/mock.snmp.inc.php:211
  77. /usr/local/www/librenms/includes/functions.php:254
  78. /usr/local/www/librenms/includes/functions.php:180
  79. /usr/local/www/librenms/tests/OSDiscoveryTest.php:108
  80. /usr/local/www/librenms/tests/OSDiscoveryTest.php:76
  81.  
  82. 6) LibreNMS\Tests\OSDiscoveryTest::testOS with data set "eatonups" ('eatonups')
  83. Exception: Could not translate oid: systemStatus.0
  84. Tried: snmptranslate -IR -On systemStatus.0 -M /usr/local/www/librenms/mibs:/usr/local/www/librenms/mibs/synology -m SYNOLOGY-SYSTEM-MIB
  85.  
  86. /usr/local/www/librenms/tests/mocks/mock.snmp.inc.php:150
  87. /usr/local/www/librenms/tests/mocks/mock.snmp.inc.php:211
  88. /usr/local/www/librenms/includes/functions.php:254
  89. /usr/local/www/librenms/includes/functions.php:180
  90. /usr/local/www/librenms/tests/OSDiscoveryTest.php:108
  91. /usr/local/www/librenms/tests/OSDiscoveryTest.php:76
  92.  
  93. 7) LibreNMS\Tests\OSDiscoveryTest::testOS with data set "ees" ('ees')
  94. Exception: Could not translate oid: systemStatus.0
  95. Tried: snmptranslate -IR -On systemStatus.0 -M /usr/local/www/librenms/mibs:/usr/local/www/librenms/mibs/synology -m SYNOLOGY-SYSTEM-MIB
  96.  
  97. /usr/local/www/librenms/tests/mocks/mock.snmp.inc.php:150
  98. /usr/local/www/librenms/tests/mocks/mock.snmp.inc.php:211
  99. /usr/local/www/librenms/includes/functions.php:254
  100. /usr/local/www/librenms/includes/functions.php:180
  101. /usr/local/www/librenms/tests/OSDiscoveryTest.php:108
  102. /usr/local/www/librenms/tests/OSDiscoveryTest.php:76
  103.  
  104. 8) LibreNMS\Tests\OSDiscoveryTest::testOS with data set "eltex-olt" ('eltex-olt')
  105. Exception: Could not translate oid: systemStatus.0
  106. Tried: snmptranslate -IR -On systemStatus.0 -M /usr/local/www/librenms/mibs:/usr/local/www/librenms/mibs/synology -m SYNOLOGY-SYSTEM-MIB
  107.  
  108. /usr/local/www/librenms/tests/mocks/mock.snmp.inc.php:150
  109. /usr/local/www/librenms/tests/mocks/mock.snmp.inc.php:211
  110. /usr/local/www/librenms/includes/functions.php:254
  111. /usr/local/www/librenms/includes/functions.php:180
  112. /usr/local/www/librenms/tests/OSDiscoveryTest.php:108
  113. /usr/local/www/librenms/tests/OSDiscoveryTest.php:76
  114.  
  115. 9) LibreNMS\Tests\OSDiscoveryTest::testOS with data set "endian" ('endian')
  116. Exception: Could not translate oid: systemStatus.0
  117. Tried: snmptranslate -IR -On systemStatus.0 -M /usr/local/www/librenms/mibs:/usr/local/www/librenms/mibs/synology -m SYNOLOGY-SYSTEM-MIB
  118.  
  119. /usr/local/www/librenms/tests/mocks/mock.snmp.inc.php:150
  120. /usr/local/www/librenms/tests/mocks/mock.snmp.inc.php:211
  121. /usr/local/www/librenms/includes/functions.php:254
  122. /usr/local/www/librenms/includes/functions.php:180
  123. /usr/local/www/librenms/tests/OSDiscoveryTest.php:108
  124. /usr/local/www/librenms/tests/OSDiscoveryTest.php:76
  125.  
  126. 10) LibreNMS\Tests\OSDiscoveryTest::testOS with data set "engenius" ('engenius')
  127. Exception: Could not translate oid: SFA-INFO::systemName.0
  128. Tried: snmptranslate -IR -On SFA-INFO::systemName.0 -M /usr/local/www/librenms/mibs
  129.  
  130. /usr/local/www/librenms/tests/mocks/mock.snmp.inc.php:150
  131. /usr/local/www/librenms/tests/mocks/mock.snmp.inc.php:211
  132. /usr/local/www/librenms/includes/functions.php:254
  133. /usr/local/www/librenms/includes/functions.php:180
  134. /usr/local/www/librenms/tests/OSDiscoveryTest.php:108
  135. /usr/local/www/librenms/tests/OSDiscoveryTest.php:76
  136.  
  137. 11) LibreNMS\Tests\OSDiscoveryTest::testOS with data set "exinda" ('exinda')
  138. Exception: Could not translate oid: systemStatus.0
  139. Tried: snmptranslate -IR -On systemStatus.0 -M /usr/local/www/librenms/mibs:/usr/local/www/librenms/mibs/synology -m SYNOLOGY-SYSTEM-MIB
  140.  
  141. /usr/local/www/librenms/tests/mocks/mock.snmp.inc.php:150
  142. /usr/local/www/librenms/tests/mocks/mock.snmp.inc.php:211
  143. /usr/local/www/librenms/includes/functions.php:254
  144. /usr/local/www/librenms/includes/functions.php:180
  145. /usr/local/www/librenms/tests/OSDiscoveryTest.php:108
  146. /usr/local/www/librenms/tests/OSDiscoveryTest.php:76
  147.  
  148. 12) LibreNMS\Tests\OSDiscoveryTest::testOS with data set "extrahop" ('extrahop')
  149. Exception: Could not translate oid: SFA-INFO::systemName.0
  150. Tried: snmptranslate -IR -On SFA-INFO::systemName.0 -M /usr/local/www/librenms/mibs
  151.  
  152. /usr/local/www/librenms/tests/mocks/mock.snmp.inc.php:150
  153. /usr/local/www/librenms/tests/mocks/mock.snmp.inc.php:211
  154. /usr/local/www/librenms/includes/functions.php:254
  155. /usr/local/www/librenms/includes/functions.php:180
  156. /usr/local/www/librenms/tests/OSDiscoveryTest.php:108
  157. /usr/local/www/librenms/tests/OSDiscoveryTest.php:76
  158.  
  159. 13) LibreNMS\Tests\OSDiscoveryTest::testOS with data set "f5" ('f5')
  160. Exception: Could not translate oid: systemStatus.0
  161. Tried: snmptranslate -IR -On systemStatus.0 -M /usr/local/www/librenms/mibs:/usr/local/www/librenms/mibs/synology -m SYNOLOGY-SYSTEM-MIB
  162.  
  163. /usr/local/www/librenms/tests/mocks/mock.snmp.inc.php:150
  164. /usr/local/www/librenms/tests/mocks/mock.snmp.inc.php:211
  165. /usr/local/www/librenms/includes/functions.php:254
  166. /usr/local/www/librenms/includes/functions.php:180
  167. /usr/local/www/librenms/tests/OSDiscoveryTest.php:108
  168. /usr/local/www/librenms/tests/OSDiscoveryTest.php:76
  169.  
  170. 14) LibreNMS\Tests\OSDiscoveryTest::testOS with data set "freebsd" ('freebsd')
  171. Exception: Could not translate oid: CHECKPOINT-MIB::osName.0
  172. Tried: snmptranslate -IR -On CHECKPOINT-MIB::osName.0 -M /usr/local/www/librenms/mibs:/usr/local/www/librenms/mibs/checkpoint
  173.  
  174. /usr/local/www/librenms/tests/mocks/mock.snmp.inc.php:150
  175. /usr/local/www/librenms/tests/mocks/mock.snmp.inc.php:211
  176. /usr/local/www/librenms/includes/functions.php:254
  177. /usr/local/www/librenms/includes/functions.php:180
  178. /usr/local/www/librenms/tests/OSDiscoveryTest.php:108
  179. /usr/local/www/librenms/tests/OSDiscoveryTest.php:76
  180.  
  181. 15) LibreNMS\Tests\OSDiscoveryTest::testOS with data set "gaia" ('gaia')
  182. Exception: Could not translate oid: systemStatus.0
  183. Tried: snmptranslate -IR -On systemStatus.0 -M /usr/local/www/librenms/mibs:/usr/local/www/librenms/mibs/synology -m SYNOLOGY-SYSTEM-MIB
  184.  
  185. /usr/local/www/librenms/tests/mocks/mock.snmp.inc.php:150
  186. /usr/local/www/librenms/tests/mocks/mock.snmp.inc.php:211
  187. /usr/local/www/librenms/includes/functions.php:254
  188. /usr/local/www/librenms/includes/functions.php:180
  189. /usr/local/www/librenms/tests/OSDiscoveryTest.php:108
  190. /usr/local/www/librenms/tests/OSDiscoveryTest.php:76
  191.  
  192. 16) LibreNMS\Tests\OSDiscoveryTest::testOS with data set "huaweiups" ('huaweiups')
  193. Exception: Could not translate oid: systemStatus.0
  194. Tried: snmptranslate -IR -On systemStatus.0 -M /usr/local/www/librenms/mibs:/usr/local/www/librenms/mibs/synology -m SYNOLOGY-SYSTEM-MIB
  195.  
  196. /usr/local/www/librenms/tests/mocks/mock.snmp.inc.php:150
  197. /usr/local/www/librenms/tests/mocks/mock.snmp.inc.php:211
  198. /usr/local/www/librenms/includes/functions.php:254
  199. /usr/local/www/librenms/includes/functions.php:180
  200. /usr/local/www/librenms/tests/OSDiscoveryTest.php:108
  201. /usr/local/www/librenms/tests/OSDiscoveryTest.php:76
  202.  
  203. 17) LibreNMS\Tests\OSDiscoveryTest::testOS with data set "ibm-imm" ('ibm-imm')
  204. Exception: Could not translate oid: systemStatus.0
  205. Tried: snmptranslate -IR -On systemStatus.0 -M /usr/local/www/librenms/mibs:/usr/local/www/librenms/mibs/synology -m SYNOLOGY-SYSTEM-MIB
  206.  
  207. /usr/local/www/librenms/tests/mocks/mock.snmp.inc.php:150
  208. /usr/local/www/librenms/tests/mocks/mock.snmp.inc.php:211
  209. /usr/local/www/librenms/includes/functions.php:254
  210. /usr/local/www/librenms/includes/functions.php:180
  211. /usr/local/www/librenms/tests/OSDiscoveryTest.php:108
  212. /usr/local/www/librenms/tests/OSDiscoveryTest.php:76
  213.  
  214. 18) LibreNMS\Tests\OSDiscoveryTest::testOS with data set "ird" ('ird')
  215. Exception: Could not translate oid: systemStatus.0
  216. Tried: snmptranslate -IR -On systemStatus.0 -M /usr/local/www/librenms/mibs:/usr/local/www/librenms/mibs/synology -m SYNOLOGY-SYSTEM-MIB
  217.  
  218. /usr/local/www/librenms/tests/mocks/mock.snmp.inc.php:150
  219. /usr/local/www/librenms/tests/mocks/mock.snmp.inc.php:211
  220. /usr/local/www/librenms/includes/functions.php:254
  221. /usr/local/www/librenms/includes/functions.php:180
  222. /usr/local/www/librenms/tests/OSDiscoveryTest.php:108
  223. /usr/local/www/librenms/tests/OSDiscoveryTest.php:76
  224.  
  225. 19) LibreNMS\Tests\OSDiscoveryTest::testOS with data set "kemp" ('kemp')
  226. Exception: Could not translate oid: systemStatus.0
  227. Tried: snmptranslate -IR -On systemStatus.0 -M /usr/local/www/librenms/mibs:/usr/local/www/librenms/mibs/synology -m SYNOLOGY-SYSTEM-MIB
  228.  
  229. /usr/local/www/librenms/tests/mocks/mock.snmp.inc.php:150
  230. /usr/local/www/librenms/tests/mocks/mock.snmp.inc.php:211
  231. /usr/local/www/librenms/includes/functions.php:254
  232. /usr/local/www/librenms/includes/functions.php:180
  233. /usr/local/www/librenms/tests/OSDiscoveryTest.php:108
  234. /usr/local/www/librenms/tests/OSDiscoveryTest.php:76
  235.  
  236. 20) LibreNMS\Tests\OSDiscoveryTest::testOS with data set "linux" ('linux')
  237. Exception: Could not translate oid: SFA-INFO::systemName.0
  238. Tried: snmptranslate -IR -On SFA-INFO::systemName.0 -M /usr/local/www/librenms/mibs
  239.  
  240. /usr/local/www/librenms/tests/mocks/mock.snmp.inc.php:150
  241. /usr/local/www/librenms/tests/mocks/mock.snmp.inc.php:211
  242. /usr/local/www/librenms/includes/functions.php:254
  243. /usr/local/www/librenms/includes/functions.php:180
  244. /usr/local/www/librenms/tests/OSDiscoveryTest.php:108
  245. /usr/local/www/librenms/tests/OSDiscoveryTest.php:76
  246.  
  247. 21) LibreNMS\Tests\OSDiscoveryTest::testOS with data set "marathonups" ('marathonups')
  248. Exception: Could not translate oid: systemStatus.0
  249. Tried: snmptranslate -IR -On systemStatus.0 -M /usr/local/www/librenms/mibs:/usr/local/www/librenms/mibs/synology -m SYNOLOGY-SYSTEM-MIB
  250.  
  251. /usr/local/www/librenms/tests/mocks/mock.snmp.inc.php:150
  252. /usr/local/www/librenms/tests/mocks/mock.snmp.inc.php:211
  253. /usr/local/www/librenms/includes/functions.php:254
  254. /usr/local/www/librenms/includes/functions.php:180
  255. /usr/local/www/librenms/tests/OSDiscoveryTest.php:108
  256. /usr/local/www/librenms/tests/OSDiscoveryTest.php:76
  257.  
  258. 22) LibreNMS\Tests\OSDiscoveryTest::testOS with data set "mellanox" ('mellanox')
  259. Exception: Could not translate oid: systemStatus.0
  260. Tried: snmptranslate -IR -On systemStatus.0 -M /usr/local/www/librenms/mibs:/usr/local/www/librenms/mibs/synology -m SYNOLOGY-SYSTEM-MIB
  261.  
  262. /usr/local/www/librenms/tests/mocks/mock.snmp.inc.php:150
  263. /usr/local/www/librenms/tests/mocks/mock.snmp.inc.php:211
  264. /usr/local/www/librenms/includes/functions.php:254
  265. /usr/local/www/librenms/includes/functions.php:180
  266. /usr/local/www/librenms/tests/OSDiscoveryTest.php:108
  267. /usr/local/www/librenms/tests/OSDiscoveryTest.php:76
  268.  
  269. 23) LibreNMS\Tests\OSDiscoveryTest::testOS with data set "mirth" ('mirth')
  270. Exception: Could not translate oid: SFA-INFO::systemName.0
  271. Tried: snmptranslate -IR -On SFA-INFO::systemName.0 -M /usr/local/www/librenms/mibs
  272.  
  273. /usr/local/www/librenms/tests/mocks/mock.snmp.inc.php:150
  274. /usr/local/www/librenms/tests/mocks/mock.snmp.inc.php:211
  275. /usr/local/www/librenms/includes/functions.php:254
  276. /usr/local/www/librenms/includes/functions.php:180
  277. /usr/local/www/librenms/tests/OSDiscoveryTest.php:108
  278. /usr/local/www/librenms/tests/OSDiscoveryTest.php:76
  279.  
  280. 24) LibreNMS\Tests\OSDiscoveryTest::testOS with data set "netbotz" ('netbotz')
  281. Exception: Could not translate oid: systemStatus.0
  282. Tried: snmptranslate -IR -On systemStatus.0 -M /usr/local/www/librenms/mibs:/usr/local/www/librenms/mibs/synology -m SYNOLOGY-SYSTEM-MIB
  283.  
  284. /usr/local/www/librenms/tests/mocks/mock.snmp.inc.php:150
  285. /usr/local/www/librenms/tests/mocks/mock.snmp.inc.php:211
  286. /usr/local/www/librenms/includes/functions.php:254
  287. /usr/local/www/librenms/includes/functions.php:180
  288. /usr/local/www/librenms/tests/OSDiscoveryTest.php:108
  289. /usr/local/www/librenms/tests/OSDiscoveryTest.php:76
  290.  
  291. 25) LibreNMS\Tests\OSDiscoveryTest::testOS with data set "nios" ('nios')
  292. Exception: Could not translate oid: systemStatus.0
  293. Tried: snmptranslate -IR -On systemStatus.0 -M /usr/local/www/librenms/mibs:/usr/local/www/librenms/mibs/synology -m SYNOLOGY-SYSTEM-MIB
  294.  
  295. /usr/local/www/librenms/tests/mocks/mock.snmp.inc.php:150
  296. /usr/local/www/librenms/tests/mocks/mock.snmp.inc.php:211
  297. /usr/local/www/librenms/includes/functions.php:254
  298. /usr/local/www/librenms/includes/functions.php:180
  299. /usr/local/www/librenms/tests/OSDiscoveryTest.php:108
  300. /usr/local/www/librenms/tests/OSDiscoveryTest.php:76
  301.  
  302. 26) LibreNMS\Tests\OSDiscoveryTest::testOS with data set "open-e" ('open-e')
  303. Exception: Could not translate oid: SFA-INFO::systemName.0
  304. Tried: snmptranslate -IR -On SFA-INFO::systemName.0 -M /usr/local/www/librenms/mibs
  305.  
  306. /usr/local/www/librenms/tests/mocks/mock.snmp.inc.php:150
  307. /usr/local/www/librenms/tests/mocks/mock.snmp.inc.php:211
  308. /usr/local/www/librenms/includes/functions.php:254
  309. /usr/local/www/librenms/includes/functions.php:180
  310. /usr/local/www/librenms/tests/OSDiscoveryTest.php:108
  311. /usr/local/www/librenms/tests/OSDiscoveryTest.php:76
  312.  
  313. 27) LibreNMS\Tests\OSDiscoveryTest::testOS with data set "opengear" ('opengear')
  314. Exception: Could not translate oid: systemStatus.0
  315. Tried: snmptranslate -IR -On systemStatus.0 -M /usr/local/www/librenms/mibs:/usr/local/www/librenms/mibs/synology -m SYNOLOGY-SYSTEM-MIB
  316.  
  317. /usr/local/www/librenms/tests/mocks/mock.snmp.inc.php:150
  318. /usr/local/www/librenms/tests/mocks/mock.snmp.inc.php:211
  319. /usr/local/www/librenms/includes/functions.php:254
  320. /usr/local/www/librenms/includes/functions.php:180
  321. /usr/local/www/librenms/tests/OSDiscoveryTest.php:108
  322. /usr/local/www/librenms/tests/OSDiscoveryTest.php:76
  323.  
  324. 28) LibreNMS\Tests\OSDiscoveryTest::testOS with data set "pcoweb" ('pcoweb')
  325. Exception: Could not translate oid: SFA-INFO::systemName.0
  326. Tried: snmptranslate -IR -On SFA-INFO::systemName.0 -M /usr/local/www/librenms/mibs
  327.  
  328. /usr/local/www/librenms/tests/mocks/mock.snmp.inc.php:150
  329. /usr/local/www/librenms/tests/mocks/mock.snmp.inc.php:211
  330. /usr/local/www/librenms/includes/functions.php:254
  331. /usr/local/www/librenms/includes/functions.php:180
  332. /usr/local/www/librenms/tests/OSDiscoveryTest.php:108
  333. /usr/local/www/librenms/tests/OSDiscoveryTest.php:76
  334.  
  335. 29) LibreNMS\Tests\OSDiscoveryTest::testOS with data set "phybridge-flex" ('phybridge-flex')
  336. Exception: Could not translate oid: SFA-INFO::systemName.0
  337. Tried: snmptranslate -IR -On SFA-INFO::systemName.0 -M /usr/local/www/librenms/mibs
  338.  
  339. /usr/local/www/librenms/tests/mocks/mock.snmp.inc.php:150
  340. /usr/local/www/librenms/tests/mocks/mock.snmp.inc.php:211
  341. /usr/local/www/librenms/includes/functions.php:254
  342. /usr/local/www/librenms/includes/functions.php:180
  343. /usr/local/www/librenms/tests/OSDiscoveryTest.php:108
  344. /usr/local/www/librenms/tests/OSDiscoveryTest.php:76
  345.  
  346. 30) LibreNMS\Tests\OSDiscoveryTest::testOS with data set "pktj" ('pktj')
  347. Exception: Could not translate oid: GANDI-MIB::rxCounter.0
  348. Tried: snmptranslate -IR -On GANDI-MIB::rxCounter.0 -M /usr/local/www/librenms/mibs
  349.  
  350. /usr/local/www/librenms/tests/mocks/mock.snmp.inc.php:150
  351. /usr/local/www/librenms/tests/mocks/mock.snmp.inc.php:211
  352. /usr/local/www/librenms/includes/functions.php:254
  353. /usr/local/www/librenms/includes/functions.php:180
  354. /usr/local/www/librenms/tests/OSDiscoveryTest.php:108
  355. /usr/local/www/librenms/tests/OSDiscoveryTest.php:76
  356.  
  357. 31) LibreNMS\Tests\OSDiscoveryTest::testOS with data set "powercode" ('powercode')
  358. Exception: Could not translate oid: SFA-INFO::systemName.0
  359. Tried: snmptranslate -IR -On SFA-INFO::systemName.0 -M /usr/local/www/librenms/mibs
  360.  
  361. /usr/local/www/librenms/tests/mocks/mock.snmp.inc.php:150
  362. /usr/local/www/librenms/tests/mocks/mock.snmp.inc.php:211
  363. /usr/local/www/librenms/includes/functions.php:254
  364. /usr/local/www/librenms/includes/functions.php:180
  365. /usr/local/www/librenms/tests/OSDiscoveryTest.php:108
  366. /usr/local/www/librenms/tests/OSDiscoveryTest.php:76
  367.  
  368. 32) LibreNMS\Tests\OSDiscoveryTest::testOS with data set "procera" ('procera')
  369. Exception: Could not translate oid: systemStatus.0
  370. Tried: snmptranslate -IR -On systemStatus.0 -M /usr/local/www/librenms/mibs:/usr/local/www/librenms/mibs/synology -m SYNOLOGY-SYSTEM-MIB
  371.  
  372. /usr/local/www/librenms/tests/mocks/mock.snmp.inc.php:150
  373. /usr/local/www/librenms/tests/mocks/mock.snmp.inc.php:211
  374. /usr/local/www/librenms/includes/functions.php:254
  375. /usr/local/www/librenms/includes/functions.php:180
  376. /usr/local/www/librenms/tests/OSDiscoveryTest.php:108
  377. /usr/local/www/librenms/tests/OSDiscoveryTest.php:76
  378.  
  379. 33) LibreNMS\Tests\OSDiscoveryTest::testOS with data set "proxmox" ('proxmox')
  380. Exception: Could not translate oid: SFA-INFO::systemName.0
  381. Tried: snmptranslate -IR -On SFA-INFO::systemName.0 -M /usr/local/www/librenms/mibs
  382.  
  383. /usr/local/www/librenms/tests/mocks/mock.snmp.inc.php:150
  384. /usr/local/www/librenms/tests/mocks/mock.snmp.inc.php:211
  385. /usr/local/www/librenms/includes/functions.php:254
  386. /usr/local/www/librenms/includes/functions.php:180
  387. /usr/local/www/librenms/tests/OSDiscoveryTest.php:108
  388. /usr/local/www/librenms/tests/OSDiscoveryTest.php:76
  389.  
  390. 34) LibreNMS\Tests\OSDiscoveryTest::testOS with data set "ptp250" ('ptp250')
  391. Exception: Could not translate oid: systemStatus.0
  392. Tried: snmptranslate -IR -On systemStatus.0 -M /usr/local/www/librenms/mibs:/usr/local/www/librenms/mibs/synology -m SYNOLOGY-SYSTEM-MIB
  393.  
  394. /usr/local/www/librenms/tests/mocks/mock.snmp.inc.php:150
  395. /usr/local/www/librenms/tests/mocks/mock.snmp.inc.php:211
  396. /usr/local/www/librenms/includes/functions.php:254
  397. /usr/local/www/librenms/includes/functions.php:180
  398. /usr/local/www/librenms/tests/OSDiscoveryTest.php:108
  399. /usr/local/www/librenms/tests/OSDiscoveryTest.php:76
  400.  
  401. 35) LibreNMS\Tests\OSDiscoveryTest::testOS with data set "qnap" ('qnap')
  402. Exception: Could not translate oid: systemStatus.0
  403. Tried: snmptranslate -IR -On systemStatus.0 -M /usr/local/www/librenms/mibs:/usr/local/www/librenms/mibs/synology -m SYNOLOGY-SYSTEM-MIB
  404.  
  405. /usr/local/www/librenms/tests/mocks/mock.snmp.inc.php:150
  406. /usr/local/www/librenms/tests/mocks/mock.snmp.inc.php:211
  407. /usr/local/www/librenms/includes/functions.php:254
  408. /usr/local/www/librenms/includes/functions.php:180
  409. /usr/local/www/librenms/tests/OSDiscoveryTest.php:108
  410. /usr/local/www/librenms/tests/OSDiscoveryTest.php:76
  411.  
  412. 36) LibreNMS\Tests\OSDiscoveryTest::testOS with data set "remoteye4" ('remoteye4')
  413. Exception: Could not translate oid: SFA-INFO::systemName.0
  414. Tried: snmptranslate -IR -On SFA-INFO::systemName.0 -M /usr/local/www/librenms/mibs
  415.  
  416. /usr/local/www/librenms/tests/mocks/mock.snmp.inc.php:150
  417. /usr/local/www/librenms/tests/mocks/mock.snmp.inc.php:211
  418. /usr/local/www/librenms/includes/functions.php:254
  419. /usr/local/www/librenms/includes/functions.php:180
  420. /usr/local/www/librenms/tests/OSDiscoveryTest.php:108
  421. /usr/local/www/librenms/tests/OSDiscoveryTest.php:76
  422.  
  423. 37) LibreNMS\Tests\OSDiscoveryTest::testOS with data set "riverbed" ('riverbed')
  424. Exception: Could not translate oid: systemStatus.0
  425. Tried: snmptranslate -IR -On systemStatus.0 -M /usr/local/www/librenms/mibs:/usr/local/www/librenms/mibs/synology -m SYNOLOGY-SYSTEM-MIB
  426.  
  427. /usr/local/www/librenms/tests/mocks/mock.snmp.inc.php:150
  428. /usr/local/www/librenms/tests/mocks/mock.snmp.inc.php:211
  429. /usr/local/www/librenms/includes/functions.php:254
  430. /usr/local/www/librenms/includes/functions.php:180
  431. /usr/local/www/librenms/tests/OSDiscoveryTest.php:108
  432. /usr/local/www/librenms/tests/OSDiscoveryTest.php:76
  433.  
  434. 38) LibreNMS\Tests\OSDiscoveryTest::testOS with data set "secureplatform" ('secureplatform')
  435. Exception: Could not translate oid: SFA-INFO::systemName.0
  436. Tried: snmptranslate -IR -On SFA-INFO::systemName.0 -M /usr/local/www/librenms/mibs
  437.  
  438. /usr/local/www/librenms/tests/mocks/mock.snmp.inc.php:150
  439. /usr/local/www/librenms/tests/mocks/mock.snmp.inc.php:211
  440. /usr/local/www/librenms/includes/functions.php:254
  441. /usr/local/www/librenms/includes/functions.php:180
  442. /usr/local/www/librenms/tests/OSDiscoveryTest.php:108
  443. /usr/local/www/librenms/tests/OSDiscoveryTest.php:76
  444.  
  445. 39) LibreNMS\Tests\OSDiscoveryTest::testOS with data set "solaris" ('solaris')
  446. Exception: Could not translate oid: CHECKPOINT-MIB::osName.0
  447. Tried: snmptranslate -IR -On CHECKPOINT-MIB::osName.0 -M /usr/local/www/librenms/mibs:/usr/local/www/librenms/mibs/checkpoint
  448.  
  449. /usr/local/www/librenms/tests/mocks/mock.snmp.inc.php:150
  450. /usr/local/www/librenms/tests/mocks/mock.snmp.inc.php:211
  451. /usr/local/www/librenms/includes/functions.php:254
  452. /usr/local/www/librenms/includes/functions.php:180
  453. /usr/local/www/librenms/tests/OSDiscoveryTest.php:108
  454. /usr/local/www/librenms/tests/OSDiscoveryTest.php:76
  455.  
  456. 40) LibreNMS\Tests\OSDiscoveryTest::testOS with data set "sophos" ('sophos')
  457. Exception: Could not translate oid: SFA-INFO::systemName.0
  458. Tried: snmptranslate -IR -On SFA-INFO::systemName.0 -M /usr/local/www/librenms/mibs
  459.  
  460. /usr/local/www/librenms/tests/mocks/mock.snmp.inc.php:150
  461. /usr/local/www/librenms/tests/mocks/mock.snmp.inc.php:211
  462. /usr/local/www/librenms/includes/functions.php:254
  463. /usr/local/www/librenms/includes/functions.php:180
  464. /usr/local/www/librenms/tests/OSDiscoveryTest.php:108
  465. /usr/local/www/librenms/tests/OSDiscoveryTest.php:76
  466.  
  467. 41) LibreNMS\Tests\OSDiscoveryTest::testOS with data set "tomato" ('tomato')
  468. Exception: Could not translate oid: SFA-INFO::systemName.0
  469. Tried: snmptranslate -IR -On SFA-INFO::systemName.0 -M /usr/local/www/librenms/mibs
  470.  
  471. /usr/local/www/librenms/tests/mocks/mock.snmp.inc.php:150
  472. /usr/local/www/librenms/tests/mocks/mock.snmp.inc.php:211
  473. /usr/local/www/librenms/includes/functions.php:254
  474. /usr/local/www/librenms/includes/functions.php:180
  475. /usr/local/www/librenms/tests/OSDiscoveryTest.php:108
  476. /usr/local/www/librenms/tests/OSDiscoveryTest.php:76
  477.  
  478. 42) LibreNMS\Tests\OSDiscoveryTest::testOS with data set "ucos" ('ucos')
  479. Exception: Could not translate oid: systemStatus.0
  480. Tried: snmptranslate -IR -On systemStatus.0 -M /usr/local/www/librenms/mibs:/usr/local/www/librenms/mibs/synology -m SYNOLOGY-SYSTEM-MIB
  481.  
  482. /usr/local/www/librenms/tests/mocks/mock.snmp.inc.php:150
  483. /usr/local/www/librenms/tests/mocks/mock.snmp.inc.php:211
  484. /usr/local/www/librenms/includes/functions.php:254
  485. /usr/local/www/librenms/includes/functions.php:180
  486. /usr/local/www/librenms/tests/OSDiscoveryTest.php:108
  487. /usr/local/www/librenms/tests/OSDiscoveryTest.php:76
  488.  
  489. 43) LibreNMS\Tests\OSDiscoveryTest::testOS with data set "unifi" ('unifi')
  490. Exception: Could not translate oid: systemStatus.0
  491. Tried: snmptranslate -IR -On systemStatus.0 -M /usr/local/www/librenms/mibs:/usr/local/www/librenms/mibs/synology -m SYNOLOGY-SYSTEM-MIB
  492.  
  493. /usr/local/www/librenms/tests/mocks/mock.snmp.inc.php:150
  494. /usr/local/www/librenms/tests/mocks/mock.snmp.inc.php:211
  495. /usr/local/www/librenms/includes/functions.php:254
  496. /usr/local/www/librenms/includes/functions.php:180
  497. /usr/local/www/librenms/tests/OSDiscoveryTest.php:108
  498. /usr/local/www/librenms/tests/OSDiscoveryTest.php:76
  499.  
  500. 44) LibreNMS\Tests\OSDiscoveryTest::testOS with data set "wti-mpc" ('wti-mpc')
  501. Exception: Could not translate oid: SFA-INFO::systemName.0
  502. Tried: snmptranslate -IR -On SFA-INFO::systemName.0 -M /usr/local/www/librenms/mibs
  503.  
  504. /usr/local/www/librenms/tests/mocks/mock.snmp.inc.php:150
  505. /usr/local/www/librenms/tests/mocks/mock.snmp.inc.php:211
  506. /usr/local/www/librenms/includes/functions.php:254
  507. /usr/local/www/librenms/includes/functions.php:180
  508. /usr/local/www/librenms/tests/OSDiscoveryTest.php:108
  509. /usr/local/www/librenms/tests/OSDiscoveryTest.php:76
  510.  
  511. 45) LibreNMS\Tests\SnmpTrapTest::testGarbage
  512. ErrorException: ini_set(): Headers already sent. You cannot change the session module's ini settings at this time
  513.  
  514. /usr/local/www/librenms/LibreNMS/Config.php:433
  515. /usr/local/www/librenms/LibreNMS/Config.php:57
  516. /usr/local/www/librenms/app/Providers/AppServiceProvider.php:28
  517. /usr/local/www/librenms/vendor/laravel/framework/src/Illuminate/Container/BoundMethod.php:29
  518. /usr/local/www/librenms/vendor/laravel/framework/src/Illuminate/Container/BoundMethod.php:87
  519. /usr/local/www/librenms/vendor/laravel/framework/src/Illuminate/Container/BoundMethod.php:31
  520. /usr/local/www/librenms/vendor/laravel/framework/src/Illuminate/Container/Container.php:539
  521. /usr/local/www/librenms/vendor/laravel/framework/src/Illuminate/Foundation/Application.php:788
  522. /usr/local/www/librenms/vendor/laravel/framework/src/Illuminate/Foundation/Application.php:771
  523. /usr/local/www/librenms/vendor/laravel/framework/src/Illuminate/Foundation/Application.php:772
  524. /usr/local/www/librenms/vendor/laravel/framework/src/Illuminate/Foundation/Bootstrap/BootProviders.php:17
  525. /usr/local/www/librenms/vendor/laravel/framework/src/Illuminate/Foundation/Application.php:208
  526. /usr/local/www/librenms/vendor/laravel/framework/src/Illuminate/Foundation/Console/Kernel.php:267
  527. /usr/local/www/librenms/tests/CreatesApplication.php:18
  528. /usr/local/www/librenms/vendor/laravel/framework/src/Illuminate/Foundation/Testing/TestCase.php:89
  529. /usr/local/www/librenms/vendor/laravel/framework/src/Illuminate/Foundation/Testing/TestCase.php:66
  530.  
  531. 46) LibreNMS\Tests\SnmpTrapTest::testFindByIp
  532. ErrorException: ini_set(): Headers already sent. You cannot change the session module's ini settings at this time
  533.  
  534. /usr/local/www/librenms/LibreNMS/Config.php:433
  535. /usr/local/www/librenms/LibreNMS/Config.php:57
  536. /usr/local/www/librenms/app/Providers/AppServiceProvider.php:28
  537. /usr/local/www/librenms/vendor/laravel/framework/src/Illuminate/Container/BoundMethod.php:29
  538. /usr/local/www/librenms/vendor/laravel/framework/src/Illuminate/Container/BoundMethod.php:87
  539. /usr/local/www/librenms/vendor/laravel/framework/src/Illuminate/Container/BoundMethod.php:31
  540. /usr/local/www/librenms/vendor/laravel/framework/src/Illuminate/Container/Container.php:539
  541. /usr/local/www/librenms/vendor/laravel/framework/src/Illuminate/Foundation/Application.php:788
  542. /usr/local/www/librenms/vendor/laravel/framework/src/Illuminate/Foundation/Application.php:771
  543. /usr/local/www/librenms/vendor/laravel/framework/src/Illuminate/Foundation/Application.php:772
  544. /usr/local/www/librenms/vendor/laravel/framework/src/Illuminate/Foundation/Bootstrap/BootProviders.php:17
  545. /usr/local/www/librenms/vendor/laravel/framework/src/Illuminate/Foundation/Application.php:208
  546. /usr/local/www/librenms/vendor/laravel/framework/src/Illuminate/Foundation/Console/Kernel.php:267
  547. /usr/local/www/librenms/tests/CreatesApplication.php:18
  548. /usr/local/www/librenms/vendor/laravel/framework/src/Illuminate/Foundation/Testing/TestCase.php:89
  549. /usr/local/www/librenms/vendor/laravel/framework/src/Illuminate/Foundation/Testing/TestCase.php:66
  550.  
  551. 47) LibreNMS\Tests\SnmpTrapTest::testAuthorization
  552. ErrorException: ini_set(): Headers already sent. You cannot change the session module's ini settings at this time
  553.  
  554. /usr/local/www/librenms/LibreNMS/Config.php:433
  555. /usr/local/www/librenms/LibreNMS/Config.php:57
  556. /usr/local/www/librenms/app/Providers/AppServiceProvider.php:28
  557. /usr/local/www/librenms/vendor/laravel/framework/src/Illuminate/Container/BoundMethod.php:29
  558. /usr/local/www/librenms/vendor/laravel/framework/src/Illuminate/Container/BoundMethod.php:87
  559. /usr/local/www/librenms/vendor/laravel/framework/src/Illuminate/Container/BoundMethod.php:31
  560. /usr/local/www/librenms/vendor/laravel/framework/src/Illuminate/Container/Container.php:539
  561. /usr/local/www/librenms/vendor/laravel/framework/src/Illuminate/Foundation/Application.php:788
  562. /usr/local/www/librenms/vendor/laravel/framework/src/Illuminate/Foundation/Application.php:771
  563. /usr/local/www/librenms/vendor/laravel/framework/src/Illuminate/Foundation/Application.php:772
  564. /usr/local/www/librenms/vendor/laravel/framework/src/Illuminate/Foundation/Bootstrap/BootProviders.php:17
  565. /usr/local/www/librenms/vendor/laravel/framework/src/Illuminate/Foundation/Application.php:208
  566. /usr/local/www/librenms/vendor/laravel/framework/src/Illuminate/Foundation/Console/Kernel.php:267
  567. /usr/local/www/librenms/tests/CreatesApplication.php:18
  568. /usr/local/www/librenms/vendor/laravel/framework/src/Illuminate/Foundation/Testing/TestCase.php:89
  569. /usr/local/www/librenms/vendor/laravel/framework/src/Illuminate/Foundation/Testing/TestCase.php:66
  570.  
  571. 48) LibreNMS\Tests\SnmpTrapTest::testBgpUp
  572. ErrorException: ini_set(): Headers already sent. You cannot change the session module's ini settings at this time
  573.  
  574. /usr/local/www/librenms/LibreNMS/Config.php:433
  575. /usr/local/www/librenms/LibreNMS/Config.php:57
  576. /usr/local/www/librenms/app/Providers/AppServiceProvider.php:28
  577. /usr/local/www/librenms/vendor/laravel/framework/src/Illuminate/Container/BoundMethod.php:29
  578. /usr/local/www/librenms/vendor/laravel/framework/src/Illuminate/Container/BoundMethod.php:87
  579. /usr/local/www/librenms/vendor/laravel/framework/src/Illuminate/Container/BoundMethod.php:31
  580. /usr/local/www/librenms/vendor/laravel/framework/src/Illuminate/Container/Container.php:539
  581. /usr/local/www/librenms/vendor/laravel/framework/src/Illuminate/Foundation/Application.php:788
  582. /usr/local/www/librenms/vendor/laravel/framework/src/Illuminate/Foundation/Application.php:771
  583. /usr/local/www/librenms/vendor/laravel/framework/src/Illuminate/Foundation/Application.php:772
  584. /usr/local/www/librenms/vendor/laravel/framework/src/Illuminate/Foundation/Bootstrap/BootProviders.php:17
  585. /usr/local/www/librenms/vendor/laravel/framework/src/Illuminate/Foundation/Application.php:208
  586. /usr/local/www/librenms/vendor/laravel/framework/src/Illuminate/Foundation/Console/Kernel.php:267
  587. /usr/local/www/librenms/tests/CreatesApplication.php:18
  588. /usr/local/www/librenms/vendor/laravel/framework/src/Illuminate/Foundation/Testing/TestCase.php:89
  589. /usr/local/www/librenms/vendor/laravel/framework/src/Illuminate/Foundation/Testing/TestCase.php:66
  590.  
  591. 49) LibreNMS\Tests\SnmpTrapTest::testBgpDown
  592. ErrorException: ini_set(): Headers already sent. You cannot change the session module's ini settings at this time
  593.  
  594. /usr/local/www/librenms/LibreNMS/Config.php:433
  595. /usr/local/www/librenms/LibreNMS/Config.php:57
  596. /usr/local/www/librenms/app/Providers/AppServiceProvider.php:28
  597. /usr/local/www/librenms/vendor/laravel/framework/src/Illuminate/Container/BoundMethod.php:29
  598. /usr/local/www/librenms/vendor/laravel/framework/src/Illuminate/Container/BoundMethod.php:87
  599. /usr/local/www/librenms/vendor/laravel/framework/src/Illuminate/Container/BoundMethod.php:31
  600. /usr/local/www/librenms/vendor/laravel/framework/src/Illuminate/Container/Container.php:539
  601. /usr/local/www/librenms/vendor/laravel/framework/src/Illuminate/Foundation/Application.php:788
  602. /usr/local/www/librenms/vendor/laravel/framework/src/Illuminate/Foundation/Application.php:771
  603. /usr/local/www/librenms/vendor/laravel/framework/src/Illuminate/Foundation/Application.php:772
  604. /usr/local/www/librenms/vendor/laravel/framework/src/Illuminate/Foundation/Bootstrap/BootProviders.php:17
  605. /usr/local/www/librenms/vendor/laravel/framework/src/Illuminate/Foundation/Application.php:208
  606. /usr/local/www/librenms/vendor/laravel/framework/src/Illuminate/Foundation/Console/Kernel.php:267
  607. /usr/local/www/librenms/tests/CreatesApplication.php:18
  608. /usr/local/www/librenms/vendor/laravel/framework/src/Illuminate/Foundation/Testing/TestCase.php:89
  609. /usr/local/www/librenms/vendor/laravel/framework/src/Illuminate/Foundation/Testing/TestCase.php:66
  610.  
  611. 50) LibreNMS\Tests\SnmpTrapTest::testLinkDown
  612. ErrorException: ini_set(): Headers already sent. You cannot change the session module's ini settings at this time
  613.  
  614. /usr/local/www/librenms/LibreNMS/Config.php:433
  615. /usr/local/www/librenms/LibreNMS/Config.php:57
  616. /usr/local/www/librenms/app/Providers/AppServiceProvider.php:28
  617. /usr/local/www/librenms/vendor/laravel/framework/src/Illuminate/Container/BoundMethod.php:29
  618. /usr/local/www/librenms/vendor/laravel/framework/src/Illuminate/Container/BoundMethod.php:87
  619. /usr/local/www/librenms/vendor/laravel/framework/src/Illuminate/Container/BoundMethod.php:31
  620. /usr/local/www/librenms/vendor/laravel/framework/src/Illuminate/Container/Container.php:539
  621. /usr/local/www/librenms/vendor/laravel/framework/src/Illuminate/Foundation/Application.php:788
  622. /usr/local/www/librenms/vendor/laravel/framework/src/Illuminate/Foundation/Application.php:771
  623. /usr/local/www/librenms/vendor/laravel/framework/src/Illuminate/Foundation/Application.php:772
  624. /usr/local/www/librenms/vendor/laravel/framework/src/Illuminate/Foundation/Bootstrap/BootProviders.php:17
  625. /usr/local/www/librenms/vendor/laravel/framework/src/Illuminate/Foundation/Application.php:208
  626. /usr/local/www/librenms/vendor/laravel/framework/src/Illuminate/Foundation/Console/Kernel.php:267
  627. /usr/local/www/librenms/tests/CreatesApplication.php:18
  628. /usr/local/www/librenms/vendor/laravel/framework/src/Illuminate/Foundation/Testing/TestCase.php:89
  629. /usr/local/www/librenms/vendor/laravel/framework/src/Illuminate/Foundation/Testing/TestCase.php:66
  630.  
  631. 51) LibreNMS\Tests\SnmpTrapTest::testLinkUp
  632. ErrorException: ini_set(): Headers already sent. You cannot change the session module's ini settings at this time
  633.  
  634. /usr/local/www/librenms/LibreNMS/Config.php:433
  635. /usr/local/www/librenms/LibreNMS/Config.php:57
  636. /usr/local/www/librenms/app/Providers/AppServiceProvider.php:28
  637. /usr/local/www/librenms/vendor/laravel/framework/src/Illuminate/Container/BoundMethod.php:29
  638. /usr/local/www/librenms/vendor/laravel/framework/src/Illuminate/Container/BoundMethod.php:87
  639. /usr/local/www/librenms/vendor/laravel/framework/src/Illuminate/Container/BoundMethod.php:31
  640. /usr/local/www/librenms/vendor/laravel/framework/src/Illuminate/Container/Container.php:539
  641. /usr/local/www/librenms/vendor/laravel/framework/src/Illuminate/Foundation/Application.php:788
  642. /usr/local/www/librenms/vendor/laravel/framework/src/Illuminate/Foundation/Application.php:771
  643. /usr/local/www/librenms/vendor/laravel/framework/src/Illuminate/Foundation/Application.php:772
  644. /usr/local/www/librenms/vendor/laravel/framework/src/Illuminate/Foundation/Bootstrap/BootProviders.php:17
  645. /usr/local/www/librenms/vendor/laravel/framework/src/Illuminate/Foundation/Application.php:208
  646. /usr/local/www/librenms/vendor/laravel/framework/src/Illuminate/Foundation/Console/Kernel.php:267
  647. /usr/local/www/librenms/tests/CreatesApplication.php:18
  648. /usr/local/www/librenms/vendor/laravel/framework/src/Illuminate/Foundation/Testing/TestCase.php:89
  649. /usr/local/www/librenms/vendor/laravel/framework/src/Illuminate/Foundation/Testing/TestCase.php:66
  650.  
  651. 52) LibreNMS\Tests\Unit\DeviceTest::testFindByHostname
  652. ErrorException: ini_set(): Headers already sent. You cannot change the session module's ini settings at this time
  653.  
  654. /usr/local/www/librenms/LibreNMS/Config.php:433
  655. /usr/local/www/librenms/LibreNMS/Config.php:57
  656. /usr/local/www/librenms/app/Providers/AppServiceProvider.php:28
  657. /usr/local/www/librenms/vendor/laravel/framework/src/Illuminate/Container/BoundMethod.php:29
  658. /usr/local/www/librenms/vendor/laravel/framework/src/Illuminate/Container/BoundMethod.php:87
  659. /usr/local/www/librenms/vendor/laravel/framework/src/Illuminate/Container/BoundMethod.php:31
  660. /usr/local/www/librenms/vendor/laravel/framework/src/Illuminate/Container/Container.php:539
  661. /usr/local/www/librenms/vendor/laravel/framework/src/Illuminate/Foundation/Application.php:788
  662. /usr/local/www/librenms/vendor/laravel/framework/src/Illuminate/Foundation/Application.php:771
  663. /usr/local/www/librenms/vendor/laravel/framework/src/Illuminate/Foundation/Application.php:772
  664. /usr/local/www/librenms/vendor/laravel/framework/src/Illuminate/Foundation/Bootstrap/BootProviders.php:17
  665. /usr/local/www/librenms/vendor/laravel/framework/src/Illuminate/Foundation/Application.php:208
  666. /usr/local/www/librenms/vendor/laravel/framework/src/Illuminate/Foundation/Console/Kernel.php:267
  667. /usr/local/www/librenms/tests/CreatesApplication.php:18
  668. /usr/local/www/librenms/vendor/laravel/framework/src/Illuminate/Foundation/Testing/TestCase.php:89
  669. /usr/local/www/librenms/vendor/laravel/framework/src/Illuminate/Foundation/Testing/TestCase.php:66
  670.  
  671. 53) LibreNMS\Tests\Unit\DeviceTest::testFindByIpFail
  672. ErrorException: ini_set(): Headers already sent. You cannot change the session module's ini settings at this time
  673.  
  674. /usr/local/www/librenms/LibreNMS/Config.php:433
  675. /usr/local/www/librenms/LibreNMS/Config.php:57
  676. /usr/local/www/librenms/app/Providers/AppServiceProvider.php:28
  677. /usr/local/www/librenms/vendor/laravel/framework/src/Illuminate/Container/BoundMethod.php:29
  678. /usr/local/www/librenms/vendor/laravel/framework/src/Illuminate/Container/BoundMethod.php:87
  679. /usr/local/www/librenms/vendor/laravel/framework/src/Illuminate/Container/BoundMethod.php:31
  680. /usr/local/www/librenms/vendor/laravel/framework/src/Illuminate/Container/Container.php:539
  681. /usr/local/www/librenms/vendor/laravel/framework/src/Illuminate/Foundation/Application.php:788
  682. /usr/local/www/librenms/vendor/laravel/framework/src/Illuminate/Foundation/Application.php:771
  683. /usr/local/www/librenms/vendor/laravel/framework/src/Illuminate/Foundation/Application.php:772
  684. /usr/local/www/librenms/vendor/laravel/framework/src/Illuminate/Foundation/Bootstrap/BootProviders.php:17
  685. /usr/local/www/librenms/vendor/laravel/framework/src/Illuminate/Foundation/Application.php:208
  686. /usr/local/www/librenms/vendor/laravel/framework/src/Illuminate/Foundation/Console/Kernel.php:267
  687. /usr/local/www/librenms/tests/CreatesApplication.php:18
  688. /usr/local/www/librenms/vendor/laravel/framework/src/Illuminate/Foundation/Testing/TestCase.php:89
  689. /usr/local/www/librenms/vendor/laravel/framework/src/Illuminate/Foundation/Testing/TestCase.php:66
  690.  
  691. 54) LibreNMS\Tests\Unit\DeviceTest::testFindByIpv4Fail
  692. ErrorException: ini_set(): Headers already sent. You cannot change the session module's ini settings at this time
  693.  
  694. /usr/local/www/librenms/LibreNMS/Config.php:433
  695. /usr/local/www/librenms/LibreNMS/Config.php:57
  696. /usr/local/www/librenms/app/Providers/AppServiceProvider.php:28
  697. /usr/local/www/librenms/vendor/laravel/framework/src/Illuminate/Container/BoundMethod.php:29
  698. /usr/local/www/librenms/vendor/laravel/framework/src/Illuminate/Container/BoundMethod.php:87
  699. /usr/local/www/librenms/vendor/laravel/framework/src/Illuminate/Container/BoundMethod.php:31
  700. /usr/local/www/librenms/vendor/laravel/framework/src/Illuminate/Container/Container.php:539
  701. /usr/local/www/librenms/vendor/laravel/framework/src/Illuminate/Foundation/Application.php:788
  702. /usr/local/www/librenms/vendor/laravel/framework/src/Illuminate/Foundation/Application.php:771
  703. /usr/local/www/librenms/vendor/laravel/framework/src/Illuminate/Foundation/Application.php:772
  704. /usr/local/www/librenms/vendor/laravel/framework/src/Illuminate/Foundation/Bootstrap/BootProviders.php:17
  705. /usr/local/www/librenms/vendor/laravel/framework/src/Illuminate/Foundation/Application.php:208
  706. /usr/local/www/librenms/vendor/laravel/framework/src/Illuminate/Foundation/Console/Kernel.php:267
  707. /usr/local/www/librenms/tests/CreatesApplication.php:18
  708. /usr/local/www/librenms/vendor/laravel/framework/src/Illuminate/Foundation/Testing/TestCase.php:89
  709. /usr/local/www/librenms/vendor/laravel/framework/src/Illuminate/Foundation/Testing/TestCase.php:66
  710.  
  711. 55) LibreNMS\Tests\Unit\DeviceTest::testFindByIpv6Fail
  712. ErrorException: ini_set(): Headers already sent. You cannot change the session module's ini settings at this time
  713.  
  714. /usr/local/www/librenms/LibreNMS/Config.php:433
  715. /usr/local/www/librenms/LibreNMS/Config.php:57
  716. /usr/local/www/librenms/app/Providers/AppServiceProvider.php:28
  717. /usr/local/www/librenms/vendor/laravel/framework/src/Illuminate/Container/BoundMethod.php:29
  718. /usr/local/www/librenms/vendor/laravel/framework/src/Illuminate/Container/BoundMethod.php:87
  719. /usr/local/www/librenms/vendor/laravel/framework/src/Illuminate/Container/BoundMethod.php:31
  720. /usr/local/www/librenms/vendor/laravel/framework/src/Illuminate/Container/Container.php:539
  721. /usr/local/www/librenms/vendor/laravel/framework/src/Illuminate/Foundation/Application.php:788
  722. /usr/local/www/librenms/vendor/laravel/framework/src/Illuminate/Foundation/Application.php:771
  723. /usr/local/www/librenms/vendor/laravel/framework/src/Illuminate/Foundation/Application.php:772
  724. /usr/local/www/librenms/vendor/laravel/framework/src/Illuminate/Foundation/Bootstrap/BootProviders.php:17
  725. /usr/local/www/librenms/vendor/laravel/framework/src/Illuminate/Foundation/Application.php:208
  726. /usr/local/www/librenms/vendor/laravel/framework/src/Illuminate/Foundation/Console/Kernel.php:267
  727. /usr/local/www/librenms/tests/CreatesApplication.php:18
  728. /usr/local/www/librenms/vendor/laravel/framework/src/Illuminate/Foundation/Testing/TestCase.php:89
  729. /usr/local/www/librenms/vendor/laravel/framework/src/Illuminate/Foundation/Testing/TestCase.php:66
  730.  
  731. 56) LibreNMS\Tests\Unit\DeviceTest::testFindIpButNoPort
  732. ErrorException: ini_set(): Headers already sent. You cannot change the session module's ini settings at this time
  733.  
  734. /usr/local/www/librenms/LibreNMS/Config.php:433
  735. /usr/local/www/librenms/LibreNMS/Config.php:57
  736. /usr/local/www/librenms/app/Providers/AppServiceProvider.php:28
  737. /usr/local/www/librenms/vendor/laravel/framework/src/Illuminate/Container/BoundMethod.php:29
  738. /usr/local/www/librenms/vendor/laravel/framework/src/Illuminate/Container/BoundMethod.php:87
  739. /usr/local/www/librenms/vendor/laravel/framework/src/Illuminate/Container/BoundMethod.php:31
  740. /usr/local/www/librenms/vendor/laravel/framework/src/Illuminate/Container/Container.php:539
  741. /usr/local/www/librenms/vendor/laravel/framework/src/Illuminate/Foundation/Application.php:788
  742. /usr/local/www/librenms/vendor/laravel/framework/src/Illuminate/Foundation/Application.php:771
  743. /usr/local/www/librenms/vendor/laravel/framework/src/Illuminate/Foundation/Application.php:772
  744. /usr/local/www/librenms/vendor/laravel/framework/src/Illuminate/Foundation/Bootstrap/BootProviders.php:17
  745. /usr/local/www/librenms/vendor/laravel/framework/src/Illuminate/Foundation/Application.php:208
  746. /usr/local/www/librenms/vendor/laravel/framework/src/Illuminate/Foundation/Console/Kernel.php:267
  747. /usr/local/www/librenms/tests/CreatesApplication.php:18
  748. /usr/local/www/librenms/vendor/laravel/framework/src/Illuminate/Foundation/Testing/TestCase.php:89
  749. /usr/local/www/librenms/vendor/laravel/framework/src/Illuminate/Foundation/Testing/TestCase.php:66
  750.  
  751. 57) LibreNMS\Tests\Unit\DeviceTest::testFindByIp
  752. ErrorException: ini_set(): Headers already sent. You cannot change the session module's ini settings at this time
  753.  
  754. /usr/local/www/librenms/LibreNMS/Config.php:433
  755. /usr/local/www/librenms/LibreNMS/Config.php:57
  756. /usr/local/www/librenms/app/Providers/AppServiceProvider.php:28
  757. /usr/local/www/librenms/vendor/laravel/framework/src/Illuminate/Container/BoundMethod.php:29
  758. /usr/local/www/librenms/vendor/laravel/framework/src/Illuminate/Container/BoundMethod.php:87
  759. /usr/local/www/librenms/vendor/laravel/framework/src/Illuminate/Container/BoundMethod.php:31
  760. /usr/local/www/librenms/vendor/laravel/framework/src/Illuminate/Container/Container.php:539
  761. /usr/local/www/librenms/vendor/laravel/framework/src/Illuminate/Foundation/Application.php:788
  762. /usr/local/www/librenms/vendor/laravel/framework/src/Illuminate/Foundation/Application.php:771
  763. /usr/local/www/librenms/vendor/laravel/framework/src/Illuminate/Foundation/Application.php:772
  764. /usr/local/www/librenms/vendor/laravel/framework/src/Illuminate/Foundation/Bootstrap/BootProviders.php:17
  765. /usr/local/www/librenms/vendor/laravel/framework/src/Illuminate/Foundation/Application.php:208
  766. /usr/local/www/librenms/vendor/laravel/framework/src/Illuminate/Foundation/Console/Kernel.php:267
  767. /usr/local/www/librenms/tests/CreatesApplication.php:18
  768. /usr/local/www/librenms/vendor/laravel/framework/src/Illuminate/Foundation/Testing/TestCase.php:89
  769. /usr/local/www/librenms/vendor/laravel/framework/src/Illuminate/Foundation/Testing/TestCase.php:66
  770.  
  771. 58) LibreNMS\Tests\Unit\DeviceTest::testFindByIpHostname
  772. ErrorException: ini_set(): Headers already sent. You cannot change the session module's ini settings at this time
  773.  
  774. /usr/local/www/librenms/LibreNMS/Config.php:433
  775. /usr/local/www/librenms/LibreNMS/Config.php:57
  776. /usr/local/www/librenms/app/Providers/AppServiceProvider.php:28
  777. /usr/local/www/librenms/vendor/laravel/framework/src/Illuminate/Container/BoundMethod.php:29
  778. /usr/local/www/librenms/vendor/laravel/framework/src/Illuminate/Container/BoundMethod.php:87
  779. /usr/local/www/librenms/vendor/laravel/framework/src/Illuminate/Container/BoundMethod.php:31
  780. /usr/local/www/librenms/vendor/laravel/framework/src/Illuminate/Container/Container.php:539
  781. /usr/local/www/librenms/vendor/laravel/framework/src/Illuminate/Foundation/Application.php:788
  782. /usr/local/www/librenms/vendor/laravel/framework/src/Illuminate/Foundation/Application.php:771
  783. /usr/local/www/librenms/vendor/laravel/framework/src/Illuminate/Foundation/Application.php:772
  784. /usr/local/www/librenms/vendor/laravel/framework/src/Illuminate/Foundation/Bootstrap/BootProviders.php:17
  785. /usr/local/www/librenms/vendor/laravel/framework/src/Illuminate/Foundation/Application.php:208
  786. /usr/local/www/librenms/vendor/laravel/framework/src/Illuminate/Foundation/Console/Kernel.php:267
  787. /usr/local/www/librenms/tests/CreatesApplication.php:18
  788. /usr/local/www/librenms/vendor/laravel/framework/src/Illuminate/Foundation/Testing/TestCase.php:89
  789. /usr/local/www/librenms/vendor/laravel/framework/src/Illuminate/Foundation/Testing/TestCase.php:66
  790.  
  791. 59) LibreNMS\Tests\Unit\DeviceTest::testFindByIpThroughPort
  792. ErrorException: ini_set(): Headers already sent. You cannot change the session module's ini settings at this time
  793.  
  794. /usr/local/www/librenms/LibreNMS/Config.php:433
  795. /usr/local/www/librenms/LibreNMS/Config.php:57
  796. /usr/local/www/librenms/app/Providers/AppServiceProvider.php:28
  797. /usr/local/www/librenms/vendor/laravel/framework/src/Illuminate/Container/BoundMethod.php:29
  798. /usr/local/www/librenms/vendor/laravel/framework/src/Illuminate/Container/BoundMethod.php:87
  799. /usr/local/www/librenms/vendor/laravel/framework/src/Illuminate/Container/BoundMethod.php:31
  800. /usr/local/www/librenms/vendor/laravel/framework/src/Illuminate/Container/Container.php:539
  801. /usr/local/www/librenms/vendor/laravel/framework/src/Illuminate/Foundation/Application.php:788
  802. /usr/local/www/librenms/vendor/laravel/framework/src/Illuminate/Foundation/Application.php:771
  803. /usr/local/www/librenms/vendor/laravel/framework/src/Illuminate/Foundation/Application.php:772
  804. /usr/local/www/librenms/vendor/laravel/framework/src/Illuminate/Foundation/Bootstrap/BootProviders.php:17
  805. /usr/local/www/librenms/vendor/laravel/framework/src/Illuminate/Foundation/Application.php:208
  806. /usr/local/www/librenms/vendor/laravel/framework/src/Illuminate/Foundation/Console/Kernel.php:267
  807. /usr/local/www/librenms/tests/CreatesApplication.php:18
  808. /usr/local/www/librenms/vendor/laravel/framework/src/Illuminate/Foundation/Testing/TestCase.php:89
  809. /usr/local/www/librenms/vendor/laravel/framework/src/Illuminate/Foundation/Testing/TestCase.php:66
  810.  
  811. --
  812.  
  813. There was 1 failure:
  814.  
  815. 1) LibreNMS\Tests\OSDiscoveryTest::testAllFilesTested
  816. Not all snmprec files were checked: Array
  817. (
  818.     [0] => airos-af-ltu
  819.     [1] => airos-af
  820.     [2] => airos
  821.     [3] => airos_1
  822.     [4] => airos_2
  823.     [5] => ddnos
  824.     [6] => dsm
  825.     [7] => dsm_ds214
  826.     [8] => dsm_ds916
  827.     [9] => eatonups_powerxpert
  828.     [10] => ees
  829.     [11] => eltex-olt
  830.     [12] => endian
  831.     [13] => engenius_2
  832.     [14] => engenius_3
  833.     [15] => exinda
  834.     [16] => extrahop
  835.     [17] => f5
  836.     [18] => freebsd_freenas
  837.     [19] => gaia
  838.     [20] => gaia_1
  839.     [21] => gaia_1430
  840.     [22] => huaweiups
  841.     [23] => ibm-imm
  842.     [24] => ird
  843.     [25] => kemp
  844.     [26] => linux
  845.     [27] => linux_1
  846.     [28] => linux_fail2ban-legacy
  847.     [29] => linux_fail2ban-v1
  848.     [30] => linux_fbsd-nfs-client-legacy
  849.     [31] => linux_fbsd-nfs-client-v1
  850.     [32] => linux_fbsd-nfs-server-legacy
  851.     [33] => linux_fbsd-nfs-server-v1
  852.     [34] => linux_freeradius
  853.     [35] => linux_ntc
  854.     [36] => linux_ntp-client-legacy
  855.     [37] => linux_ntp-client-v1
  856.     [38] => linux_portactivity-v1
  857.     [39] => linux_ups-apcups-legacy
  858.     [40] => linux_ups-apcups-v1
  859.     [41] => linux_zfs-legacy
  860.     [42] => linux_zfs-v1
  861.     [43] => marathonups
  862.     [44] => mellanox_i5035
  863.     [45] => mirth
  864.     [46] => netbotz_2016
  865.     [47] => netbotz_2017
  866.     [48] => nios
  867.     [49] => nios_ipam
  868.     [50] => open-e
  869.     [51] => opengear
  870.     [52] => opengear_1
  871.     [53] => pcoweb
  872.     [54] => phybridge-flex
  873.     [55] => pktj
  874.     [56] => powercode
  875.     [57] => procera
  876.     [58] => proxmox
  877.     [59] => ptp250
  878.     [60] => qnap
  879.     [61] => qnap_ts431
  880.     [62] => remoteye4
  881.     [63] => riverbed
  882.     [64] => secureplatform
  883.     [65] => solaris
  884.     [66] => solaris_1
  885.     [67] => solaris_11
  886.     [68] => sophos
  887.     [69] => sophos_1
  888.     [70] => sophos_utm
  889.     [71] => tomato
  890.     [72] => ucos
  891.     [73] => ucos_1
  892.     [74] => unifi
  893.     [75] => unifi_achd
  894.     [76] => wti-mpc
  895. )
  896.  
  897. Failed asserting that an array is empty.
  898.  
  899. /usr/local/www/librenms/tests/OSDiscoveryTest.php:90
  900.  
  901. [37;41mERRORS![0m
  902. [37;41mTests: 1091[0m[37;41m, Assertions: 2361[0m[37;41m, Errors: 59[0m[37;41m, Failures: 1[0m[37;41m, Skipped: 555[0m[37;41m.[0m
  903.